Target
Discoidin domain-containing receptor 2
Ligand
BDBM13530
Substrate
Meas. Tech.
EC50 Test
IC50
675±0.0 nM
Citation
 Kim, HGTan, LWeisberg, ELLiu, FCanning, PChoi, HGEzell, SAWu, HZhao, ZWang, JMandinova, AGriffin, JDBullock, ANLiu, QLee, SWGray, NS Discovery of a potent and selective DDR1 receptor tyrosine kinase inhibitor. ACS Chem Biol 8:2145-50 (2013)  
Target
Name:
Discoidin domain-containing receptor 2
Synonyms:
DDR2 Discoidin domain receptor 2 (DDR2) Discoidin domain-containing receptor 2 (DDR2) NTRKR3 TYRO10
Type:
Protein
Mol. Mass.:
96717.07
Organism:
Homo sapiens (Human)
Description:
Q16832
Residue:
855
  
Inhibitor
Name:
BDBM13530
Synonyms:
4-[(4-methylpiperazin-1-yl)methyl]-N-[4-methyl-3-[(4-pyridin-3-ylpyrimidin-2-yl)amino]phenyl]benzamide Gleevec Imatinib, 21 STI-571 US10906896, Cpd imatinib US11725005, Compound imatinib cid_5291 med.21724, Compound 6
Type:
Small organic molecule
Emp. Form.:
C29H31N7O
Mol. Mass.:
493.6027
SMILES:
CN1CCN(Cc2ccc(cc2)C(=O)Nc2ccc(C)c(Nc3nccc(n3)-c3cccnc3)c2)CC1
: