Target
Aldo-keto reductase family 1 member B1
Ligand
BDBM104023
Substrate
Meas. Tech.
IC50 Activity Assays
pH
7±n/a
Temperature
298.15±n/a K
IC50
1.90e+3± 1.0e+2 nM
Citation
 Fanfrlík, JFanfrlík, MKolár, MHurný, DHurný, FXCousido-Siah, AMitschler, ARezác, JRezác, ELep?ík, MLepšík, PMatejícek, JVeselý, AHobza, P Modulation of aldose reductase inhibition by halogen bond tuning. ACS Chem Biol 8:2484-92 (2013)  
Target
Name:
Aldo-keto reductase family 1 member B1
Synonyms:
AKR1B1 ALDR_HUMAN AR Aldose Reductase (ALR2) Aldose reductase (AR)
Type:
Protein
Mol. Mass.:
35855.50
Organism:
Homo sapiens (Human)
Description:
P15121. 4LAU; 2IKI; 4LB4; 2FZD; 2FZ8; 1US0
Residue:
316
  
Inhibitor
Name:
BDBM104023
Synonyms:
MK257
Type:
Small organic molecule
Emp. Form.:
C16H13ClINO4
Mol. Mass.:
445.636
SMILES:
OC(=O)COc1cc(Cl)ccc1C(=O)NCc1ccc(I)cc1
: