Target
Neutrophil elastase
Ligand
BDBM104826
Substrate
Meas. Tech.
Inhibition Assay
IC50
<0.3±0.0 nM
Citation
 Von Nussbaum, FKarthaus, DAnlauf, SDelbeck, MLi, VMMeibom, DLustig, K Triazolo and tetrazolo pyrimidine derivatives as HNE inhibitors for treating COPD US Patent  US8569314 Publication Date 10/29/2013 
Target
Name:
Neutrophil elastase
Synonyms:
Bone marrow serine protease Coagulation factor X ELANE Elastase HLE Leukocyte elastase Medullasin Neutrophil elastase (HNE) PMN elastase Trypsin
Type:
Enzyme
Mol. Mass.:
28532.38
Organism:
Homo sapiens (Human)
Description:
P08246
Residue:
267
  
Inhibitor
Name:
BDBM104826
Synonyms:
US8569314, 56
Type:
Small organic molecule
Emp. Form.:
C23H18F3N7
Mol. Mass.:
449.4311
SMILES:
CCNc1nc2N(C(C)=C([N+]#[C-])[C@@H](c3ccc(cc3)C#N)n2n1)c1cccc(c1)C(F)(F)F
: