Target
3-phosphoinositide-dependent protein kinase 1
Ligand
BDBM105375
Substrate
Meas. Tech.
Kinase Assay
IC50
2±0.0 nM
Citation
 Engelhardt, HKofink, CMcConnell, D Chemical compounds US Patent  US8575203 Publication Date 11/5/2013 
Target
Name:
3-phosphoinositide-dependent protein kinase 1
Synonyms:
3-Phosphoinositide-Dependent Protein Kinase 1 (PDK1) 3-phosphoinositide-dependent protein kinase 1 3-phosphoinositide-dependent protein kinase 1 (PDK-1) Isoform 2 of 3-phosphoinositide-dependent protein kinase 1 PDPK1 Phosphoinositide-dependent protein kinase 1 (PDK1) hPDK1
Type:
Enzyme
Mol. Mass.:
63157.65
Organism:
Homo sapiens (Human)
Description:
O15530
Residue:
556
  
Inhibitor
Name:
BDBM105375
Synonyms:
US8575203, I-125.17
Type:
Small organic molecule
Emp. Form.:
C32H29F3N4O3
Mol. Mass.:
574.5929
SMILES:
CN1CCC[C@@H](COc2ccnc3ccc(cc23)C#CCNC(=O)c2cccn(Cc3cc(F)c(F)c(F)c3)c2=O)C1
: