Target
Insulin-like growth factor 1 receptor
Ligand
BDBM106987
Substrate
Meas. Tech.
Tyrosine Kinase Assay
pH
7.4±0
IC50
122±n/a nM
Citation
 Wittman, MDMastalerz, HZimmermann, KSaulnier, MGVelaparthi, UVyas, DMZhang, GJohnson, WLFrennesson, DBSang, XLiu, PLangley, DR Pyrrolotriazine kinase inhibitors US Patent  US8592579 Publication Date 11/26/2013 
Target
Name:
Insulin-like growth factor 1 receptor
Synonyms:
CD_antigen=CD221 IGF1R Insulin-like growth factor 1 receptor (IGF1R) Insulin-like growth factor 1 receptor alpha chain Insulin-like growth factor I receptor | Insulin-like growth factor receptor (IGFR)
Type:
Protein
Mol. Mass.:
154776.79
Organism:
Homo sapiens (Human)
Description:
P08069
Residue:
1367
  
Inhibitor
Name:
BDBM106987
Synonyms:
US8592579, 41
Type:
Small organic molecule
Emp. Form.:
C21H27N9O
Mol. Mass.:
421.4988
SMILES:
N[C@H]1CCN(C1)C(=O)[C@@H]1CCCN1c1nc(Nc2cc([nH]n2)C2CC2)c2cccn2n1
: