Target
Acetyl-coenzyme A transporter 1
Ligand
BDBM107348
Substrate
Meas. Tech.
Binding Assay
pH
7.4±0
IC50
1.3±0.0 nM
Citation
 Maekawa, TIgawa, H Fused ring compound and use thereof US Patent  US8592431 Publication Date 11/26/2013 
Target
Name:
Acetyl-coenzyme A transporter 1
Synonyms:
ACATN AT1 SLC33A1
Type:
Enzyme
Mol. Mass.:
60911.27
Organism:
Homo sapiens (Human)
Description:
O00400
Residue:
549
  
Inhibitor
Name:
BDBM107348
Synonyms:
US8592431, 136
Type:
Small organic molecule
Emp. Form.:
C31H33FN6O4
Mol. Mass.:
572.6299
SMILES:
CCCc1c(Cc2ccc(cc2F)-c2ccccc2-c2nc(=O)o[nH]2)c(=O)n(C2CCOC(C)(C)C2)c2nc(C)nn12
: