Target
Acetyl-coenzyme A transporter 1
Ligand
BDBM107351
Substrate
Meas. Tech.
Binding Assay
pH
7.4±0
IC50
1.7±0.0 nM
Citation
 Maekawa, TIgawa, H Fused ring compound and use thereof US Patent  US8592431 Publication Date 11/26/2013 
Target
Name:
Acetyl-coenzyme A transporter 1
Synonyms:
ACATN AT1 SLC33A1
Type:
Enzyme
Mol. Mass.:
60911.27
Organism:
Homo sapiens (Human)
Description:
O00400
Residue:
549
  
Inhibitor
Name:
BDBM107351
Synonyms:
US8592431, 139
Type:
Small organic molecule
Emp. Form.:
C31H34N6O4
Mol. Mass.:
554.6395
SMILES:
CCCCc1c(Cc2ccc(cc2)-c2ccccc2-c2nc(=O)o[nH]2)c(=O)n([C@@H]2C[C@H](C)O[C@H](C)C2)c2ncnn12
: