Target
Kynurenine/alpha-aminoadipate aminotransferase, mitochondrial
Ligand
BDBM107721
Substrate
Meas. Tech.
Inhibition Spectra Assay
IC50
11.5±0.0 nM
Citation
 Dounay, ABMcAllister, LParikh, VDRong, SVerhoest, PR KAT II inhibitors US Patent  US8598200 Publication Date 12/3/2013 
Target
Name:
Kynurenine/alpha-aminoadipate aminotransferase, mitochondrial
Synonyms:
2-aminoadipate aminotransferase AADAT Alpha-aminoadipate aminotransferase KAT2 Kynurenine aminotransferase II Kynurenine--oxoglutarate aminotransferase II Kynurenine--oxoglutarate transaminase II
Type:
Enzyme
Mol. Mass.:
47353.09
Organism:
Homo sapiens (Human)
Description:
Q8N5Z0
Residue:
425
  
Inhibitor
Name:
BDBM107721
Synonyms:
US8933095, 3
Type:
Small organic molecule
Emp. Form.:
C14H16N4O2
Mol. Mass.:
272.3024
SMILES:
Cn1nc2N(O)C(=O)[C@@H](N)Cc2c1Cc1ccccc1
: