Target
Glycogen phosphorylase, muscle form
Ligand
BDBM10849
Substrate
Meas. Tech.
Inhibition Assay
pH
7.2±n/a
Temperature
295.15±n/a K
IC50
1.44e+5±n/a nM
Comments
extracted
Citation
 Zhang, LJia, XDong, JChen, DLiu, JZhang, LWen, X Synthesis and evaluation of novel oleanolic acid derivatives as potential antidiabetic agents. Chem Biol Drug Des 83:297-305 (2014)  
Target
Name:
Glycogen phosphorylase, muscle form
Synonyms:
Glycogen Phosphorylase (PYGM) Glycogen phosphorylase, muscle form PYGM | PYGM_RABIT
Type:
Enzyme
Mol. Mass.:
97296.32
Organism:
Oryctolagus cuniculus (rabbit)
Description:
Phosphorylation of Ser-15 converts phosphorylase B (unphosphorylated) to phosphorylase A.
Residue:
843
  
Inhibitor
Name:
BDBM10849
Synonyms:
1,3,7-trimethyl-2,3,6,7-tetrahydro-1H-purine-2,6-dione CHEMBL113 caffeine
Type:
Small organic molecule
Emp. Form.:
C8H10N4O2
Mol. Mass.:
194.1906
SMILES:
Cn1cnc2n(C)c(=O)n(C)c(=O)c12
: