Target
1-deoxy-D-xylulose-5-phosphate synthase
Ligand
BDBM108230
Substrate
Meas. Tech.
DXP Synthase Inhibition Assay
pH
8±n/a
Temperature
310.15±n/a K
IC50
3.54e+5± 9.0e+4 nM
Comments
extracted
Citation
 Morris, FVierling, RBoucher, LBosch, JFreel Meyers, CL DXP synthase-catalyzed C-N bond formation: nitroso substrate specificity studies guide selective inhibitor design. Chembiochem 14:1309-15 (2013)  
Target
Name:
1-deoxy-D-xylulose-5-phosphate synthase
Synonyms:
1-Deoxy-D-xylulose-5-phosphate synthase (DXP synthase)) dxs | yajP
Type:
Protein
Mol. Mass.:
67617.17
Organism:
Escherichia coli K-12 (Enterobacteria)
Description:
Residue:
620
  
Inhibitor
Name:
BDBM108230
Synonyms:
6‐hydroxy‐5‐nitrosonaphthalene‐2‐sulfonamide (Substrate 7)
Type:
Small organic molecule
Emp. Form.:
C10H8N2O4S
Mol. Mass.:
252.247
SMILES:
NS(=O)(=O)c1ccc2c(N=O)c(O)ccc2c1
: