Target
Metabotropic glutamate receptor 5
Ligand
BDBM109136
Substrate
Meas. Tech.
Binding Assay
Temperature
298.15±n/a K
Ki
0.65±0.0 nM
Comments
extracted
Citation
 Cosford, NDSeiders, TJPayne, JERoppe, JRHuang, DSmith, NDPoon, SFKing, CEastman, BWWang, BArruda, JMVernier, JZhao, X Thiazolyl mGluR5 antagonists and methods for their use US Patent  US8609852 Publication Date 12/17/2013 
Target
Name:
Metabotropic glutamate receptor 5
Synonyms:
GRM5_RAT Grm5 Mglur5 metabotropic glutamate 5/1-C metabotropic glutamate 5a
Type:
Enzyme
Mol. Mass.:
131900.14
Organism:
Rattus norvegicus (Rat)
Description:
P31424
Residue:
1203
  
Inhibitor
Name:
BDBM109136
Synonyms:
US8609852, 43
Type:
Small organic molecule
Emp. Form.:
C17H11ClN2S
Mol. Mass.:
310.801
SMILES:
Cc1nc(cs1)C#Cc1cncc(c1)-c1cccc(Cl)c1
: