Target
Aurora kinase A/Targeting protein for Xklp2 [1-43]
Ligand
BDBM109209
Substrate
Meas. Tech.
Inhibition Assay Protocol A
Temperature
303.15±n/a K
Ki
2.17±0.0 nM
IC50
2070±90 nM
Comments
extracted
Citation
 Lavogina, DEnkvist, EViht, KUri, A Long residence times revealed by Aurora A kinase-targeting fluorescent probes derived from inhibitors MLN8237 and VX-689. Chembiochem 15:443-50 (2014)  
Target
Name:
Aurora kinase A/Targeting protein for Xklp2 [1-43]
Synonyms:
Aurora A/TPX2 (1-43)
Type:
Mol. Mass.:
Description:
Components:
This complex has 2 components.
Component 1
Name:
Aurora kinase A
Synonyms:
AIK ARK1 AURKA AYK1 Aurora kinase A (AURA) Aurora kinase A (Aurora A) Aurora-related kinase 1 BTAK Breast-tumor-amplified kinase STK15 Serine/threonine kinase 15 Serine/threonine-protein kinase aurora A hARK1
Type:
Serine/threonine-protein kinase
Mol. Mass.:
45830.98
Organism:
Homo sapiens (Human)
Description:
O14965
Residue:
403
  
Component 2
Name:
Targeting protein for Xklp2 [1-43]
Synonyms:
C20orf1 DIL2 Microtubule-associated TPX2 (aa 1-43) | TPX2_HUMAN
Type:
Protein
Mol. Mass.:
4917.03
Organism:
Homo sapiens (Human)
Description:
Q9ULW0[1-43]
Residue:
43
  
Inhibitor
Name:
BDBM109209
Synonyms:
VX-689
Type:
Small organic molecule
Emp. Form.:
C22H21ClFN3O3S
Mol. Mass.:
461.937
SMILES:
OC(=O)[C@]1(Cc2cccc(Nc3nccs3)n2)CCC(CC1)Oc1cccc(Cl)c1F
: