Target
3-phosphoinositide-dependent protein kinase 1 [51-359]
Ligand
BDBM281820
Substrate
Meas. Tech.
PDK1 kinase assay
IC50
<100±n/a nM
Citation
 Arndt, JChan, TGuckian, KKumaravel, GLee, WLin, EYScott, DSun, LThomas, Jvan Vloten, KWang, DZhang, LErlanson, D Heterocyclic compounds useful as PDK1 inhibitors US Patent  US10030016 Publication Date 7/24/2018 
Target
Name:
3-phosphoinositide-dependent protein kinase 1 [51-359]
Synonyms:
3-Phosphoinositide-Dependent Protein Kinase 1 (PDK1) 3-phosphoinositide-dependent protein kinase 1 (aa 51-359) PDK1 (aa 51-359) PDPK1_HUMAN | hPDK1
Type:
Enzyme Catalytic Domain
Mol. Mass.:
35302.26
Organism:
Homo sapiens (Human)
Description:
O15530[51-359]
Residue:
309
  
Inhibitor
Name:
BDBM281820
Synonyms:
2-({[5-(4-aminoquinazolin-6- yl)thiophen-2-yl]methyl}amino)- N-(2,4-difluorobenzyl)pyridine- 3-carboxamide (TFA salt) | US10030016, Example 3.8
Type:
Small organic molecule
Emp. Form.:
C26H20F2N6OS
Mol. Mass.:
502.538
SMILES:
Nc1ncnc2ccc(cc12)-c1ccc(CNc2ncccc2C(=O)NCc2ccc(F)cc2F)s1
: