Target
Proto-oncogene tyrosine-protein kinase Src
Ligand
BDBM4518
Substrate
cdc2 substrate peptide
Meas. Tech.
Kinase Inhibition Assay
IC50
19±n/a nM
Citation
 Boschelli, DHWang, YDYe, FWu, BZhang, NDutia, MPowell, DWWissner, AArndt, KWeber, JMBoschelli, F Synthesis and Src kinase inhibitory activity of a series of 4-phenylamino-3-quinolinecarbonitriles. J Med Chem 44:822-33 (2001)  
Target
Name:
Proto-oncogene tyrosine-protein kinase Src
Synonyms:
Calmodulin/Proto-oncogene tyrosine-protein kinase Src Proto-oncogene c-Src SRC SRC_HUMAN V-src sarcoma (Schmidt-Ruppin A-2) viral oncogene homolog (avian) p60-Src | pp60c-src
Type:
Protein
Mol. Mass.:
59838.60
Organism:
Homo sapiens (Human)
Description:
P12931
Residue:
536
  
Inhibitor
Name:
BDBM4518
Synonyms:
4-Phenylamino-3-quinolinecarbonitrile deriv. 23 4-[(2,4-dichlorophenyl)amino]-6,7-bis[3-(morpholin-4-yl)propoxy]quinoline-3-carbonitrile
Type:
Small organic molecule
Emp. Form.:
C30H35Cl2N5O4
Mol. Mass.:
600.536
SMILES:
Clc1ccc(Nc2c(cnc3cc(OCCCN4CCOCC4)c(OCCCN4CCOCC4)cc23)C#N)c(Cl)c1
:
Substrate
Name:
cdc2 substrate peptide
Synonyms:
Type:
Peptide
Mol. Mass.:
358.43
Organism:
Description:
100 uM ATP as co-substrate
Residue:
3
NA