Target
Androgen receptor
Ligand
BDBM112836
Substrate
Meas. Tech.
Biological Assay
IC50
1±n/a nM
Citation
 Miller, CP Selective androgen receptor modulators US Patent  US8629167 Publication Date 1/14/2014 
Target
Name:
Androgen receptor
Synonyms:
ANDR_RAT Ar Nr3c4 | androgen
Type:
Enzyme
Mol. Mass.:
98219.08
Organism:
Rattus norvegicus (Rat)
Description:
P15207
Residue:
902
  
Inhibitor
Name:
BDBM112836
Synonyms:
US8629167, 47
Type:
Small organic molecule
Emp. Form.:
C21H19ClN4O3
Mol. Mass.:
410.854
SMILES:
CCc1c(N[C@H]([C@H](C)O)C2=NOC(O2)c2ccc(cc2)C#N)ccc(C#N)c1Cl
: