Target
Disintegrin and metalloproteinase domain-containing protein 17
Ligand
BDBM113870
Substrate
Meas. Tech.
Counterscreen for exosite inhibitors of ADAM10: QFRET-based biochemical high throughput dose response assay to identify inhibitors of ADAM17
IC50
69490±n/a nM
Citation
 PubChem, PC Counterscreen for exosite inhibitors of ADAM10: QFRET-based biochemical high throughput dose response assay to identify inhibitors of ADAM17 PubChem Bioassay (2014)[AID] 
Target
Name:
Disintegrin and metalloproteinase domain-containing protein 17
Synonyms:
ADA17_HUMAN CSVP Disintegrin and metalloproteinase domain-containing protein 17 (ADAM17) TNF-alpha convertase TNF-alpha-converting enzyme (TACE) Tumor necrosis factor-α converting enzyme (TACE)
Type:
Enzyme
Mol. Mass.:
93007.89
Organism:
Homo sapiens (Human)
Description:
Residue:
824
  
Inhibitor
Name:
BDBM113870
Synonyms:
MLS000585031 N-[(E)-[2-[(3-bromophenyl)methoxy]phenyl]methylideneamino]-2-(4-methoxyanilino)propanamide SMR000203794 | cid_56642833
Type:
Small organic molecule
Emp. Form.:
C24H24BrN3O3
Mol. Mass.:
482.37
SMILES:
COc1ccc(NC(C)C(=O)N\N=C\c2ccccc2OCc2cccc(Br)c2)cc1
: