Target
Disintegrin and metalloproteinase domain-containing protein 17
Ligand
BDBM113888
Substrate
Meas. Tech.
Counterscreen for exosite inhibitors of ADAM10: QFRET-based biochemical high throughput dose response assay to identify inhibitors of ADAM17
IC50
69496±n/a nM
Citation
 PubChem, PC Counterscreen for exosite inhibitors of ADAM10: QFRET-based biochemical high throughput dose response assay to identify inhibitors of ADAM17 PubChem Bioassay (2014)[AID] 
Target
Name:
Disintegrin and metalloproteinase domain-containing protein 17
Synonyms:
ADA17_HUMAN CSVP Disintegrin and metalloproteinase domain-containing protein 17 (ADAM17) TNF-alpha convertase TNF-alpha-converting enzyme (TACE) Tumor necrosis factor-α converting enzyme (TACE)
Type:
Enzyme
Mol. Mass.:
93007.89
Organism:
Homo sapiens (Human)
Description:
Residue:
824
  
Inhibitor
Name:
BDBM113888
Synonyms:
2-[1-(4-methylphenyl)benzimidazol-2-yl]sulfanyl-N-(3-sulfamoylphenyl)acetamide 2-[[1-(4-methylphenyl)-2-benzimidazolyl]thio]-N-(3-sulfamoylphenyl)acetamide MLS000416794 cid_4879538
Type:
Small organic molecule
Emp. Form.:
C22H20N4O3S2
Mol. Mass.:
452.549
SMILES:
Cc1ccc(cc1)-n1c(SCC(=O)Nc2cccc(c2)S(N)(=O)=O)nc2ccccc12
: