Target
Disintegrin and metalloproteinase domain-containing protein 17
Ligand
BDBM113891
Substrate
Meas. Tech.
Counterscreen for exosite inhibitors of ADAM10: QFRET-based biochemical high throughput dose response assay to identify inhibitors of ADAM17
IC50
69488±n/a nM
Citation
 PubChem, PC Counterscreen for exosite inhibitors of ADAM10: QFRET-based biochemical high throughput dose response assay to identify inhibitors of ADAM17 PubChem Bioassay (2014)[AID] 
Target
Name:
Disintegrin and metalloproteinase domain-containing protein 17
Synonyms:
ADA17_HUMAN CSVP Disintegrin and metalloproteinase domain-containing protein 17 (ADAM17) TNF-alpha convertase TNF-alpha-converting enzyme (TACE) Tumor necrosis factor-α converting enzyme (TACE)
Type:
Enzyme
Mol. Mass.:
93007.89
Organism:
Homo sapiens (Human)
Description:
Residue:
824
  
Inhibitor
Name:
BDBM113891
Synonyms:
3-[(2-methoxyphenyl)-prop-2-enylsulfamoyl]benzoic acid [2-(1H-indol-3-yl)-2-oxoethyl] ester MLS000417875 [2-(1H-indol-3-yl)-2-oxidanylidene-ethyl] 3-[(2-methoxyphenyl)-prop-2-enyl-sulfamoyl]benzoate cid_2116235
Type:
Small organic molecule
Emp. Form.:
C27H24N2O6S
Mol. Mass.:
504.554
SMILES:
COc1ccccc1N(CC=C)S(=O)(=O)c1cccc(c1)C(=O)OCC(=O)c1c[nH]c2ccccc12
: