Target
Disintegrin and metalloproteinase domain-containing protein 17
Ligand
BDBM113895
Substrate
Meas. Tech.
Counterscreen for exosite inhibitors of ADAM10: QFRET-based biochemical high throughput dose response assay to identify inhibitors of ADAM17
IC50
69490±n/a nM
Citation
 PubChem, PC Counterscreen for exosite inhibitors of ADAM10: QFRET-based biochemical high throughput dose response assay to identify inhibitors of ADAM17 PubChem Bioassay (2014)[AID] 
Target
Name:
Disintegrin and metalloproteinase domain-containing protein 17
Synonyms:
ADA17_HUMAN CSVP Disintegrin and metalloproteinase domain-containing protein 17 (ADAM17) TNF-alpha convertase TNF-alpha-converting enzyme (TACE) Tumor necrosis factor-α converting enzyme (TACE)
Type:
Enzyme
Mol. Mass.:
93007.89
Organism:
Homo sapiens (Human)
Description:
Residue:
824
  
Inhibitor
Name:
BDBM113895
Synonyms:
1-cyclohexyl-4-(4-ethylphenyl)-1,3-dihydro-2H-imidazole-2-thione 3-cyclohexyl-5-(4-ethylphenyl)-1H-imidazole-2-thione SMR000310578 | cid_4105277
Type:
Small organic molecule
Emp. Form.:
C17H22N2S
Mol. Mass.:
286.435
SMILES:
CCc1ccc(cc1)-c1cn(C2CCCCC2)c(=S)[nH]1
: