Target
Disintegrin and metalloproteinase domain-containing protein 17
Ligand
BDBM51399
Substrate
Meas. Tech.
Counterscreen for exosite inhibitors of ADAM10: QFRET-based biochemical high throughput dose response assay to identify inhibitors of ADAM17
IC50
69473±n/a nM
Citation
 PubChem, PC Counterscreen for exosite inhibitors of ADAM10: QFRET-based biochemical high throughput dose response assay to identify inhibitors of ADAM17 PubChem Bioassay (2014)[AID] 
Target
Name:
Disintegrin and metalloproteinase domain-containing protein 17
Synonyms:
ADA17_HUMAN CSVP Disintegrin and metalloproteinase domain-containing protein 17 (ADAM17) TNF-alpha convertase TNF-alpha-converting enzyme (TACE) Tumor necrosis factor-α converting enzyme (TACE)
Type:
Enzyme
Mol. Mass.:
93007.89
Organism:
Homo sapiens (Human)
Description:
Residue:
824
  
Inhibitor
Name:
BDBM51399
Synonyms:
2-cyclohexyl-N-(1H-1,2,4-triazol-5-yl)acetamide MLS-0072999.0001 | cid_704227
Type:
Small organic molecule
Emp. Form.:
C10H16N4O
Mol. Mass.:
208.2602
SMILES:
O=C(CC1CCCCC1)Nc1nnc[nH]1
: