Target
Disintegrin and metalloproteinase domain-containing protein 17
Ligand
BDBM113988
Substrate
Meas. Tech.
Counterscreen for exosite inhibitors of ADAM10: QFRET-based biochemical high throughput dose response assay to identify inhibitors of ADAM17
IC50
69488±n/a nM
Citation
 PubChem, PC Counterscreen for exosite inhibitors of ADAM10: QFRET-based biochemical high throughput dose response assay to identify inhibitors of ADAM17 PubChem Bioassay (2014)[AID] 
Target
Name:
Disintegrin and metalloproteinase domain-containing protein 17
Synonyms:
ADA17_HUMAN CSVP Disintegrin and metalloproteinase domain-containing protein 17 (ADAM17) TNF-alpha convertase TNF-alpha-converting enzyme (TACE) Tumor necrosis factor-α converting enzyme (TACE)
Type:
Enzyme
Mol. Mass.:
93007.89
Organism:
Homo sapiens (Human)
Description:
Residue:
824
  
Inhibitor
Name:
BDBM113988
Synonyms:
(3R,4aR,5R,7S)-5-cyclopropyl-3-[2-(3-methylbutylamino)-2-oxoethyl]-1-(1-naphthalenylmethyl)-2-oxo-7-propan-2-yl-3,4,5,7-tetrahydropyrano[4,3-b]pyridine-4a-carboxylic acid methyl ester MLS003876098 cid_60157266 methyl (3R,4aR,5R,7S)-5-cyclopropyl-3-[2-(3-methylbutylamino)-2-oxoethyl]-1-(naphthalen-1-ylmethyl)-2-oxo-7-propan-2-yl-3,4,5,7-tetrahydropyrano[4,3-b]pyridine-4a-carboxylate
Type:
Small organic molecule
Emp. Form.:
C34H44N2O5
Mol. Mass.:
560.7236
SMILES:
COC(=O)[C@]12C[C@H](CC(=O)NCCC(C)C)C(=O)N(Cc3cccc4ccccc34)C1=C[C@@H](O[C@@H]2C1CC1)C(C)C
: