Target
Disintegrin and metalloproteinase domain-containing protein 10
Ligand
BDBM113833
Substrate
Meas. Tech.
QFRET-based biochemical high throughput dose response assay to identify exosite inhibitors of ADAM10.
IC50
7724±n/a nM
Citation
 PubChem, PC QFRET-based biochemical high throughput dose response assay to identify exosite inhibitors of ADAM10. PubChem Bioassay (2014)[AID] 
Target
Name:
Disintegrin and metalloproteinase domain-containing protein 10
Synonyms:
ADA10_HUMAN Disintegrin and metalloproteinase domain-containing protein 10 (ADAM10) MADM
Type:
Enzyme
Mol. Mass.:
84160.93
Organism:
Homo sapiens (Human)
Description:
O14672
Residue:
748
  
Inhibitor
Name:
BDBM113833
Synonyms:
(6Z)-3-methoxy-2-methyl-6-[5-methyl-4-(1-phenyl-4-pyrazolyl)-1,2-dihydropyrazol-3-ylidene]-1-cyclohexa-2,4-dienone (6Z)-3-methoxy-2-methyl-6-[5-methyl-4-(1-phenylpyrazol-4-yl)-3-pyrazolin-3-ylidene]cyclohexa-2,4-dien-1-one MLS000530730 cid_5505376
Type:
Small organic molecule
Emp. Form.:
C21H20N4O2
Mol. Mass.:
360.4091
SMILES:
COc1ccc(-c2n[nH]c(C)c2-c2cnn(c2)-c2ccccc2)c(O)c1C
: