Target
Disintegrin and metalloproteinase domain-containing protein 10
Ligand
BDBM52212
Substrate
Meas. Tech.
QFRET-based biochemical high throughput dose response assay to identify exosite inhibitors of ADAM10.
IC50
8802±n/a nM
Citation
 PubChem, PC QFRET-based biochemical high throughput dose response assay to identify exosite inhibitors of ADAM10. PubChem Bioassay (2014)[AID] 
Target
Name:
Disintegrin and metalloproteinase domain-containing protein 10
Synonyms:
ADA10_HUMAN Disintegrin and metalloproteinase domain-containing protein 10 (ADAM10) MADM
Type:
Enzyme
Mol. Mass.:
84160.93
Organism:
Homo sapiens (Human)
Description:
O14672
Residue:
748
  
Inhibitor
Name:
BDBM52212
Synonyms:
2-amino-4-asaryl-5-keto-7,7-dimethyl-6,8-dihydro-4H-chromene-3-carbonitrile 2-amino-7,7-dimethyl-5-oxo-4-(2,4,5-trimethoxyphenyl)-6,8-dihydro-4H-chromene-3-carbonitrile MLS000104773 cid_2828670
Type:
Small organic molecule
Emp. Form.:
C21H24N2O5
Mol. Mass.:
384.4257
SMILES:
COc1cc(OC)c(cc1OC)C1C(C#N)C(=N)OC2=C1C(=O)CC(C)(C)C2
: