Target
Disintegrin and metalloproteinase domain-containing protein 10
Ligand
BDBM72230
Substrate
Meas. Tech.
QFRET-based biochemical high throughput dose response assay to identify exosite inhibitors of ADAM10.
IC50
7722±n/a nM
Citation
 PubChem, PC QFRET-based biochemical high throughput dose response assay to identify exosite inhibitors of ADAM10. PubChem Bioassay (2014)[AID] 
Target
Name:
Disintegrin and metalloproteinase domain-containing protein 10
Synonyms:
ADA10_HUMAN Disintegrin and metalloproteinase domain-containing protein 10 (ADAM10) MADM
Type:
Enzyme
Mol. Mass.:
84160.93
Organism:
Homo sapiens (Human)
Description:
O14672
Residue:
748
  
Inhibitor
Name:
BDBM72230
Synonyms:
MLS000586574 N-(3-chlorophenyl)-5-[2-(4-chlorophenyl)ethylsulfamoyl]-2-fluoranyl-benzamide N-(3-chlorophenyl)-5-[2-(4-chlorophenyl)ethylsulfamoyl]-2-fluorobenzamide cid_3354885
Type:
Small organic molecule
Emp. Form.:
C21H17Cl2FN2O3S
Mol. Mass.:
467.341
SMILES:
Fc1ccc(cc1C(=O)Nc1cccc(Cl)c1)S(=O)(=O)NCCc1ccc(Cl)cc1
: