Target
Disintegrin and metalloproteinase domain-containing protein 10
Ligand
BDBM53160
Substrate
Meas. Tech.
QFRET-based biochemical high throughput dose response assay to identify exosite inhibitors of ADAM10.
IC50
9607±n/a nM
Citation
 PubChem, PC QFRET-based biochemical high throughput dose response assay to identify exosite inhibitors of ADAM10. PubChem Bioassay (2014)[AID] 
Target
Name:
Disintegrin and metalloproteinase domain-containing protein 10
Synonyms:
ADA10_HUMAN Disintegrin and metalloproteinase domain-containing protein 10 (ADAM10) MADM
Type:
Enzyme
Mol. Mass.:
84160.93
Organism:
Homo sapiens (Human)
Description:
O14672
Residue:
748
  
Inhibitor
Name:
BDBM53160
Synonyms:
3-[2-(2-carboxyethyl)-5-phenyl-1-pyrrolyl]benzoic acid 3-[2-(2-carboxyethyl)-5-phenyl-pyrrol-1-yl]benzoic acid 3-[2-(3-hydroxy-3-oxopropyl)-5-phenyl-pyrrol-1-yl]benzoic acid SMR000558717 | cid_954366
Type:
Small organic molecule
Emp. Form.:
C20H17NO4
Mol. Mass.:
335.3533
SMILES:
OC(=O)CCc1ccc(-c2ccccc2)n1-c1cccc(c1)C(O)=O
: