Target
Disintegrin and metalloproteinase domain-containing protein 10
Ligand
BDBM113929
Substrate
Meas. Tech.
QFRET-based biochemical high throughput dose response assay to identify exosite inhibitors of ADAM10.
IC50
12227±n/a nM
Citation
 PubChem, PC QFRET-based biochemical high throughput dose response assay to identify exosite inhibitors of ADAM10. PubChem Bioassay (2014)[AID] 
Target
Name:
Disintegrin and metalloproteinase domain-containing protein 10
Synonyms:
ADA10_HUMAN Disintegrin and metalloproteinase domain-containing protein 10 (ADAM10) MADM
Type:
Enzyme
Mol. Mass.:
84160.93
Organism:
Homo sapiens (Human)
Description:
O14672
Residue:
748
  
Inhibitor
Name:
BDBM113929
Synonyms:
(2S)-2-(4-fluorobenzyl)hex-5-enoic acid [(1S)-2-[[(2R)-2-[2-[benzyl(2-hydroxyethyl)amino]-2-keto-ethyl]pent-4-enoyl]amino]-1-phenyl-ethyl] ester MLS002319902 [(1S)-2-[[(2R)-2-[2-[2-hydroxyethyl-(phenylmethyl)amino]-2-oxidanylidene-ethyl]pent-4-enoyl]amino]-1-phenyl-ethyl] (2S)-2-[(4-fluorophenyl)methyl]hex-5-enoate cid_44201473
Type:
Small organic molecule
Emp. Form.:
C37H43FN2O5
Mol. Mass.:
614.7461
SMILES:
OCCN(Cc1ccccc1)C(=O)C[C@@H](CC=C)C(=O)NC[C@@H](OC(=O)[C@@H](CCC=C)Cc1ccc(F)cc1)c1ccccc1
: