Target
Disintegrin and metalloproteinase domain-containing protein 10
Ligand
BDBM67948
Substrate
Meas. Tech.
Counterscreen for exosite inhibitors of ADAM17: Fluorescence resonance energy transfer (FRET)-based biochemical high throughput dose response assay to identify inhibitors of ADAM10
IC50
13718±n/a nM
Citation
 PubChem, PC Counterscreen for exosite inhibitors of ADAM17: Fluorescence resonance energy transfer (FRET)-based biochemical high throughput dose response assay to identify inhibitors of ADAM10 PubChem Bioassay (2014)[AID] 
Target
Name:
Disintegrin and metalloproteinase domain-containing protein 10
Synonyms:
ADA10_HUMAN Disintegrin and metalloproteinase domain-containing protein 10 (ADAM10) MADM
Type:
Enzyme
Mol. Mass.:
84160.93
Organism:
Homo sapiens (Human)
Description:
O14672
Residue:
748
  
Inhibitor
Name:
BDBM67948
Synonyms:
3-cyclohexyl-4-[(E)-[(E)-3-phenylprop-2-enylidene]amino]-1H-1,2,4-triazole-5-thione 5-cyclohexyl-4-[(3-phenyl-2-propen-1-ylidene)amino]-4H-1,2,4-triazole-3-thiol SMR000197354 | cid_1955243
Type:
Small organic molecule
Emp. Form.:
C17H20N4S
Mol. Mass.:
312.432
SMILES:
S=c1[nH]nc(C2CCCCC2)n1N=CC=Cc1ccccc1
: