Target
Disintegrin and metalloproteinase domain-containing protein 10
Ligand
BDBM114051
Substrate
Meas. Tech.
Counterscreen for exosite inhibitors of ADAM17: Fluorescence resonance energy transfer (FRET)-based biochemical high throughput dose response assay to identify inhibitors of ADAM10
IC50
7724±n/a nM
Citation
 PubChem, PC Counterscreen for exosite inhibitors of ADAM17: Fluorescence resonance energy transfer (FRET)-based biochemical high throughput dose response assay to identify inhibitors of ADAM10 PubChem Bioassay (2014)[AID] 
Target
Name:
Disintegrin and metalloproteinase domain-containing protein 10
Synonyms:
ADA10_HUMAN Disintegrin and metalloproteinase domain-containing protein 10 (ADAM10) MADM
Type:
Enzyme
Mol. Mass.:
84160.93
Organism:
Homo sapiens (Human)
Description:
O14672
Residue:
748
  
Inhibitor
Name:
BDBM114051
Synonyms:
2-[(2,6-dichlorophenyl)sulfonylamino]-3-methyl-butyric acid [2-(1H-indol-3-yl)-2-keto-ethyl] ester MLS000409274 [2-(1H-indol-3-yl)-2-oxidanylidene-ethyl] 2-[[2,6-bis(chloranyl)phenyl]sulfonylamino]-3-methyl-butanoate cid_4834110
Type:
Small organic molecule
Emp. Form.:
C21H20Cl2N2O5S
Mol. Mass.:
483.365
SMILES:
CC(C)C(NS(=O)(=O)c1c(Cl)cccc1Cl)C(=O)OCC(=O)c1c[nH]c2ccccc12
: