Target
Disintegrin and metalloproteinase domain-containing protein 10
Ligand
BDBM114074
Substrate
Meas. Tech.
Counterscreen for exosite inhibitors of ADAM17: Fluorescence resonance energy transfer (FRET)-based biochemical high throughput dose response assay to identify inhibitors of ADAM10
IC50
7726±n/a nM
Citation
 PubChem, PC Counterscreen for exosite inhibitors of ADAM17: Fluorescence resonance energy transfer (FRET)-based biochemical high throughput dose response assay to identify inhibitors of ADAM10 PubChem Bioassay (2014)[AID] 
Target
Name:
Disintegrin and metalloproteinase domain-containing protein 10
Synonyms:
ADA10_HUMAN Disintegrin and metalloproteinase domain-containing protein 10 (ADAM10) MADM
Type:
Enzyme
Mol. Mass.:
84160.93
Organism:
Homo sapiens (Human)
Description:
O14672
Residue:
748
  
Inhibitor
Name:
BDBM114074
Synonyms:
4-chloro-3-[(4-methylphenyl)amino]-5-oxo-2,5-dihydrofuran-2-yl 4-methylbenzoate 4-methylbenzoic acid [4-chloro-5-keto-3-(p-toluidino)-2H-furan-2-yl] ester SMR000305975 [4-chloro-3-(4-methylanilino)-5-oxo-2H-furan-2-yl] 4-methylbenzoate | cid_16188062
Type:
Small organic molecule
Emp. Form.:
C19H16ClNO4
Mol. Mass.:
357.788
SMILES:
Cc1ccc(NC2=C(OC(=O)c3ccc(C)cc3)OC(=O)C2Cl)cc1
: