Target
Disintegrin and metalloproteinase domain-containing protein 10
Ligand
BDBM114129
Substrate
Meas. Tech.
Counterscreen for exosite inhibitors of ADAM17: Fluorescence resonance energy transfer (FRET)-based biochemical high throughput dose response assay to identify inhibitors of ADAM10
IC50
7726±n/a nM
Citation
 PubChem, PC Counterscreen for exosite inhibitors of ADAM17: Fluorescence resonance energy transfer (FRET)-based biochemical high throughput dose response assay to identify inhibitors of ADAM10 PubChem Bioassay (2014)[AID] 
Target
Name:
Disintegrin and metalloproteinase domain-containing protein 10
Synonyms:
ADA10_HUMAN Disintegrin and metalloproteinase domain-containing protein 10 (ADAM10) MADM
Type:
Enzyme
Mol. Mass.:
84160.93
Organism:
Homo sapiens (Human)
Description:
O14672
Residue:
748
  
Inhibitor
Name:
BDBM114129
Synonyms:
6-(3-fluorobenzyl)-1,1-diketo-3-(2-naphthyl)-2,3-dihydro-1,2,6-thiadiazine-4-carboxylic acid ethyl ester MLS002603746 cid_42627986 ethyl 6-[(3-fluorophenyl)methyl]-3-naphthalen-2-yl-1,1-dioxo-2,3-dihydro-1,2,6-thiadiazine-4-carboxylate
Type:
Small organic molecule
Emp. Form.:
C23H21FN2O4S
Mol. Mass.:
440.487
SMILES:
CCOC(=O)C1=CN(Cc2cccc(F)c2)S(=O)(=O)NC1c1ccc2ccccc2c1
: