Target
Disintegrin and metalloproteinase domain-containing protein 10
Ligand
BDBM114152
Substrate
Meas. Tech.
Counterscreen for exosite inhibitors of ADAM17: Fluorescence resonance energy transfer (FRET)-based biochemical high throughput dose response assay to identify inhibitors of ADAM10
IC50
7716±n/a nM
Citation
 PubChem, PC Counterscreen for exosite inhibitors of ADAM17: Fluorescence resonance energy transfer (FRET)-based biochemical high throughput dose response assay to identify inhibitors of ADAM10 PubChem Bioassay (2014)[AID] 
Target
Name:
Disintegrin and metalloproteinase domain-containing protein 10
Synonyms:
ADA10_HUMAN Disintegrin and metalloproteinase domain-containing protein 10 (ADAM10) MADM
Type:
Enzyme
Mol. Mass.:
84160.93
Organism:
Homo sapiens (Human)
Description:
O14672
Residue:
748
  
Inhibitor
Name:
BDBM114152
Synonyms:
MLS003512359 N-phenylcarbamic acid [(2S)-2-[4-(4-methylphenyl)sulfonyl-7-oxo-1,4-diazepan-1-yl]-3-phenylpropyl] ester [(2S)-2-[4-(4-methylphenyl)sulfonyl-7-oxidanylidene-1,4-diazepan-1-yl]-3-phenyl-propyl] N-phenylcarbamate cid_25010880
Type:
Small organic molecule
Emp. Form.:
C28H31N3O5S
Mol. Mass.:
521.628
SMILES:
Cc1ccc(cc1)S(=O)(=O)N1CCN([C@H](COC(=O)Nc2ccccc2)Cc2ccccc2)C(=O)CC1
: