Target
Disintegrin and metalloproteinase domain-containing protein 17
Ligand
BDBM114073
Substrate
Meas. Tech.
QFRET-based biochemical high throughput dose response assay to identify exosite inhibitors of ADAM17
IC50
69468±n/a nM
Citation
 PubChem, PC QFRET-based biochemical high throughput dose response assay to identify exosite inhibitors of ADAM17 PubChem Bioassay (2014)[AID] 
Target
Name:
Disintegrin and metalloproteinase domain-containing protein 17
Synonyms:
ADA17_HUMAN CSVP Disintegrin and metalloproteinase domain-containing protein 17 (ADAM17) TNF-alpha convertase TNF-alpha-converting enzyme (TACE) Tumor necrosis factor-α converting enzyme (TACE)
Type:
Enzyme
Mol. Mass.:
93007.89
Organism:
Homo sapiens (Human)
Description:
Residue:
824
  
Inhibitor
Name:
BDBM114073
Synonyms:
4-(3,5-dimethoxyphenyl)-1H-pyrazol-5-amine SMR000293990 cid_978094
Type:
Small organic molecule
Emp. Form.:
C11H13N3O2
Mol. Mass.:
219.2398
SMILES:
COc1cc(OC)cc(c1)-c1cn[nH]c1N
: