Target
Disintegrin and metalloproteinase domain-containing protein 17
Ligand
BDBM114086
Substrate
Meas. Tech.
QFRET-based biochemical high throughput dose response assay to identify exosite inhibitors of ADAM17
IC50
69386±n/a nM
Citation
 PubChem, PC QFRET-based biochemical high throughput dose response assay to identify exosite inhibitors of ADAM17 PubChem Bioassay (2014)[AID] 
Target
Name:
Disintegrin and metalloproteinase domain-containing protein 17
Synonyms:
ADA17_HUMAN CSVP Disintegrin and metalloproteinase domain-containing protein 17 (ADAM17) TNF-alpha convertase TNF-alpha-converting enzyme (TACE) Tumor necrosis factor-α converting enzyme (TACE)
Type:
Enzyme
Mol. Mass.:
93007.89
Organism:
Homo sapiens (Human)
Description:
Residue:
824
  
Inhibitor
Name:
BDBM114086
Synonyms:
5-(4-chlorophenyl)-2,4-imidazolidinedione 5-(4-chlorophenyl)imidazolidine-2,4-dione SMR000498503 | cid_97124
Type:
Small organic molecule
Emp. Form.:
C9H7ClN2O2
Mol. Mass.:
210.617
SMILES:
Clc1ccc(cc1)C1NC(=O)NC1=O
: