Target
Tyrosyl-DNA phosphodiesterase 2
Ligand
BDBM32085
Substrate
Meas. Tech.
Epi Absorbance-based biochemical high throughput dose response assay to identify inhibitors of human tyrosyl-DNA phosphodiesterase 2 (TDP2)
IC50
3266±n/a nM
Citation
 PubChem, PC Epi Absorbance-based biochemical high throughput dose response assay to identify inhibitors of human tyrosyl-DNA phosphodiesterase 2 (TDP2) PubChem Bioassay (2014)[AID] 
Target
Name:
Tyrosyl-DNA phosphodiesterase 2
Synonyms:
EAP2 ETS1-associated protein 2 TDP2 TTRAP Tyr-DNA phosphodiesterase 2 Tyrosyl-DNA phosphodiesterase 2 (hTDP2) VPg unlinkase | hTDP2
Type:
Enzyme Catalytic Domain
Mol. Mass.:
40916.54
Organism:
Homo sapiens (Human)
Description:
gi_23510348
Residue:
362
  
Inhibitor
Name:
BDBM32085
Synonyms:
MLS000085603 N-(2-hydroxy-1,3-dioxo-2,3-dihydro-1H-inden-2-yl)benzamide N-(2-hydroxy-1,3-dioxoinden-2-yl)benzamide SMR000020538 | cid_3237318
Type:
Small organic molecule
Emp. Form.:
C16H11NO4
Mol. Mass.:
281.2628
SMILES:
OC1(NC(=O)c2ccccc2)C(=O)c2ccccc2C1=O
: