Target
Tyrosyl-DNA phosphodiesterase 2
Ligand
BDBM60311
Substrate
Meas. Tech.
Epi Absorbance-based biochemical high throughput dose response assay to identify inhibitors of human tyrosyl-DNA phosphodiesterase 2 (TDP2)
IC50
915±n/a nM
Citation
 PubChem, PC Epi Absorbance-based biochemical high throughput dose response assay to identify inhibitors of human tyrosyl-DNA phosphodiesterase 2 (TDP2) PubChem Bioassay (2014)[AID] 
Target
Name:
Tyrosyl-DNA phosphodiesterase 2
Synonyms:
EAP2 ETS1-associated protein 2 TDP2 TTRAP Tyr-DNA phosphodiesterase 2 Tyrosyl-DNA phosphodiesterase 2 (hTDP2) VPg unlinkase | hTDP2
Type:
Enzyme Catalytic Domain
Mol. Mass.:
40916.54
Organism:
Homo sapiens (Human)
Description:
gi_23510348
Residue:
362
  
Inhibitor
Name:
BDBM60311
Synonyms:
2-methyl-4,5-dioxo-3H-benzo[e]indole-1-carboxylic acid ethyl ester MLS000701140 cid_1736294 ethyl 2-methyl-4,5-dioxo-3H-benzo[e]indole-1-carboxylate | ethyl 2-methyl-4,5-dioxo-4,5-dihydro-3H-benzo[e]indole-1-carboxylate
Type:
Small organic molecule
Emp. Form.:
C16H13NO4
Mol. Mass.:
283.2787
SMILES:
CCOC(=O)c1c(C)[nH]c2c1-c1ccccc1C(=O)C2=O
: