Target
Tyrosyl-DNA phosphodiesterase 2
Ligand
BDBM64030
Substrate
Meas. Tech.
Epi Absorbance-based biochemical high throughput dose response assay to identify inhibitors of human tyrosyl-DNA phosphodiesterase 2 (TDP2)
IC50
1273±n/a nM
Citation
 PubChem, PC Epi Absorbance-based biochemical high throughput dose response assay to identify inhibitors of human tyrosyl-DNA phosphodiesterase 2 (TDP2) PubChem Bioassay (2014)[AID] 
Target
Name:
Tyrosyl-DNA phosphodiesterase 2
Synonyms:
EAP2 ETS1-associated protein 2 TDP2 TTRAP Tyr-DNA phosphodiesterase 2 Tyrosyl-DNA phosphodiesterase 2 (hTDP2) VPg unlinkase | hTDP2
Type:
Enzyme Catalytic Domain
Mol. Mass.:
40916.54
Organism:
Homo sapiens (Human)
Description:
gi_23510348
Residue:
362
  
Inhibitor
Name:
BDBM64030
Synonyms:
3-Amino-6,6-dimethyl-2-phenyl-2,8-dihydro-6H-pyrano[3,4-c]pyridazine-4-carbonitrile 3-azanyl-6,6-dimethyl-2-phenyl-8H-pyrano[3,4-c]pyridazine-4-carbonitrile SMR000513314 | cid_738951
Type:
Small organic molecule
Emp. Form.:
C16H16N4O
Mol. Mass.:
280.3244
SMILES:
CC1(C)Cc2c(CO1)nn(-c1ccccc1)c(=N)c2C#N
: