Target
Tyrosyl-DNA phosphodiesterase 2
Ligand
BDBM48038
Substrate
Meas. Tech.
Epi Absorbance-based biochemical high throughput dose response assay to identify inhibitors of human tyrosyl-DNA phosphodiesterase 2 (TDP2)
IC50
1411±n/a nM
Citation
 PubChem, PC Epi Absorbance-based biochemical high throughput dose response assay to identify inhibitors of human tyrosyl-DNA phosphodiesterase 2 (TDP2) PubChem Bioassay (2014)[AID] 
Target
Name:
Tyrosyl-DNA phosphodiesterase 2
Synonyms:
EAP2 ETS1-associated protein 2 TDP2 TTRAP Tyr-DNA phosphodiesterase 2 Tyrosyl-DNA phosphodiesterase 2 (hTDP2) VPg unlinkase | hTDP2
Type:
Enzyme Catalytic Domain
Mol. Mass.:
40916.54
Organism:
Homo sapiens (Human)
Description:
gi_23510348
Residue:
362
  
Inhibitor
Name:
BDBM48038
Synonyms:
4-[(E)-[3-(2-methylanilino)-4-oxo-1-naphthalenylidene]amino]sulfonylbenzoic acid 4-[(E)-[3-[(2-methylphenyl)amino]-4-oxidanylidene-naphthalen-1-ylidene]amino]sulfonylbenzoic acid MLS000948152 cid_6023693
Type:
Small organic molecule
Emp. Form.:
C24H18N2O5S
Mol. Mass.:
446.475
SMILES:
Cc1ccccc1NC1=CC(=NS(=O)(=O)c2ccc(cc2)C(O)=O)c2ccccc2C1=O
: