Target
Tyrosyl-DNA phosphodiesterase 2
Ligand
BDBM22857
Substrate
Meas. Tech.
Epi Absorbance-based biochemical high throughput dose response assay to identify inhibitors of human tyrosyl-DNA phosphodiesterase 2 (TDP2)
IC50
1907±n/a nM
Citation
 PubChem, PC Epi Absorbance-based biochemical high throughput dose response assay to identify inhibitors of human tyrosyl-DNA phosphodiesterase 2 (TDP2) PubChem Bioassay (2014)[AID] 
Target
Name:
Tyrosyl-DNA phosphodiesterase 2
Synonyms:
EAP2 ETS1-associated protein 2 TDP2 TTRAP Tyr-DNA phosphodiesterase 2 Tyrosyl-DNA phosphodiesterase 2 (hTDP2) VPg unlinkase | hTDP2
Type:
Enzyme Catalytic Domain
Mol. Mass.:
40916.54
Organism:
Homo sapiens (Human)
Description:
gi_23510348
Residue:
362
  
Inhibitor
Name:
BDBM22857
Synonyms:
1,2-Dione-Based Compound, 14 CHEMBL51931 cid_6763
Type:
Small organic molecule
Emp. Form.:
C14H8O2
Mol. Mass.:
208.2121
SMILES:
O=C1C(=O)c2ccccc2-c2ccccc12
: