Target
Tyrosyl-DNA phosphodiesterase 2
Ligand
BDBM30725
Substrate
Meas. Tech.
Epi Absorbance-based biochemical high throughput dose response assay to identify inhibitors of human tyrosyl-DNA phosphodiesterase 2 (TDP2)
IC50
128225±n/a nM
Citation
 PubChem, PC Epi Absorbance-based biochemical high throughput dose response assay to identify inhibitors of human tyrosyl-DNA phosphodiesterase 2 (TDP2) PubChem Bioassay (2014)[AID] 
Target
Name:
Tyrosyl-DNA phosphodiesterase 2
Synonyms:
EAP2 ETS1-associated protein 2 TDP2 TTRAP Tyr-DNA phosphodiesterase 2 Tyrosyl-DNA phosphodiesterase 2 (hTDP2) VPg unlinkase | hTDP2
Type:
Enzyme Catalytic Domain
Mol. Mass.:
40916.54
Organism:
Homo sapiens (Human)
Description:
gi_23510348
Residue:
362
  
Inhibitor
Name:
BDBM30725
Synonyms:
MLS000079925 N-[3-cyano-1-(4-methoxyphenyl)pyrrolo[3,2-b]quinoxalin-2-yl]-2-furamide SMR000039887 | cid_658939
Type:
Small organic molecule
Emp. Form.:
C23H15N5O3
Mol. Mass.:
409.3969
SMILES:
COc1ccc(cc1)-n1c(NC(=O)c2ccco2)c(C#N)c2nc3ccccc3nc12
: