Target
Tyrosyl-DNA phosphodiesterase 2
Ligand
BDBM80810
Substrate
Meas. Tech.
Epi Absorbance-based biochemical high throughput dose response assay to identify inhibitors of human tyrosyl-DNA phosphodiesterase 2 (TDP2)
IC50
1074±n/a nM
Citation
 PubChem, PC Epi Absorbance-based biochemical high throughput dose response assay to identify inhibitors of human tyrosyl-DNA phosphodiesterase 2 (TDP2) PubChem Bioassay (2014)[AID] 
Target
Name:
Tyrosyl-DNA phosphodiesterase 2
Synonyms:
EAP2 ETS1-associated protein 2 TDP2 TTRAP Tyr-DNA phosphodiesterase 2 Tyrosyl-DNA phosphodiesterase 2 (hTDP2) VPg unlinkase | hTDP2
Type:
Enzyme Catalytic Domain
Mol. Mass.:
40916.54
Organism:
Homo sapiens (Human)
Description:
gi_23510348
Residue:
362
  
Inhibitor
Name:
BDBM80810
Synonyms:
7-amino-6-chloro-5,8-diketo-naphthalene-2-sulfonamide 7-amino-6-chloro-5,8-dioxonaphthalene-2-sulfonamide MLS002667101 cid_240739
Type:
Small organic molecule
Emp. Form.:
C10H7ClN2O4S
Mol. Mass.:
286.692
SMILES:
NC1=C(Cl)C(=O)c2ccc(cc2C1=O)S(N)(=O)=O
: