Target
1-phosphatidylinositol 4,5-bisphosphate phosphodiesterase beta-3
Ligand
BDBM114220
Substrate
Meas. Tech.
Fluorescence-based biochemical high throughput dose response assay to identify inhibitors of phospholipase C isozymes (PLC-B3)
IC50
122567±n/a nM
Citation
 PubChem, PC Fluorescence-based biochemical high throughput dose response assay to identify inhibitors of phospholipase C isozymes (PLC-B3) PubChem Bioassay (2014)[AID] 
Target
Name:
1-phosphatidylinositol 4,5-bisphosphate phosphodiesterase beta-3
Synonyms:
PLCB3 Phospholipase C, beta 3 (phosphatidylinositol-specific) | Phospholipase C-beta-3
Type:
PROTEIN
Mol. Mass.:
138786.29
Organism:
Homo sapiens (Human)
Description:
EBI_12586
Residue:
1234
  
Inhibitor
Name:
BDBM114220
Synonyms:
(2Z)-2-cyano-2-(1-methyl-4-pyrimidinylidene)acetic acid ethyl ester MLS000085178 cid_3245564 ethyl (2Z)-2-cyano-2-(1-methylpyrimidin-4-ylidene)ethanoate | ethyl (2Z)-cyano(1-methylpyrimidin-4(1H)-ylidene)acetate
Type:
Small organic molecule
Emp. Form.:
C10H11N3O2
Mol. Mass.:
205.2132
SMILES:
CCOC(=O)C(\C#N)=C1\C=CN(C)C=N1
: