Target
1-phosphatidylinositol 4,5-bisphosphate phosphodiesterase beta-3
Ligand
BDBM81014
Substrate
Meas. Tech.
Fluorescence-based biochemical high throughput dose response assay to identify inhibitors of phospholipase C isozymes (PLC-B3)
IC50
122493±n/a nM
Citation
 PubChem, PC Fluorescence-based biochemical high throughput dose response assay to identify inhibitors of phospholipase C isozymes (PLC-B3) PubChem Bioassay (2014)[AID] 
Target
Name:
1-phosphatidylinositol 4,5-bisphosphate phosphodiesterase beta-3
Synonyms:
PLCB3 Phospholipase C, beta 3 (phosphatidylinositol-specific) | Phospholipase C-beta-3
Type:
PROTEIN
Mol. Mass.:
138786.29
Organism:
Homo sapiens (Human)
Description:
EBI_12586
Residue:
1234
  
Inhibitor
Name:
BDBM81014
Synonyms:
1-(2,3-dihydroindol-1-yl)-2-(1-methylindol-3-yl)sulfonyl-ethanone 1-(2,3-dihydroindol-1-yl)-2-[(1-methyl-3-indolyl)sulfonyl]ethanone MLS000101449 cid_2157548
Type:
Small organic molecule
Emp. Form.:
C19H18N2O3S
Mol. Mass.:
354.423
SMILES:
Cn1cc(c2ccccc12)S(=O)(=O)CC(=O)N1CCc2ccccc12
: