Target
1-phosphatidylinositol 4,5-bisphosphate phosphodiesterase beta-3
Ligand
BDBM47961
Substrate
Meas. Tech.
Fluorescence-based biochemical high throughput dose response assay to identify inhibitors of phospholipase C isozymes (PLC-B3)
IC50
122490±n/a nM
Citation
 PubChem, PC Fluorescence-based biochemical high throughput dose response assay to identify inhibitors of phospholipase C isozymes (PLC-B3) PubChem Bioassay (2014)[AID] 
Target
Name:
1-phosphatidylinositol 4,5-bisphosphate phosphodiesterase beta-3
Synonyms:
PLCB3 Phospholipase C, beta 3 (phosphatidylinositol-specific) | Phospholipase C-beta-3
Type:
PROTEIN
Mol. Mass.:
138786.29
Organism:
Homo sapiens (Human)
Description:
EBI_12586
Residue:
1234
  
Inhibitor
Name:
BDBM47961
Synonyms:
(2Z)-1,3-diketo-2-[(5-methyl-2-furyl)methylene]indane-5-carboxylic acid (2Z)-2-[(5-methylfuran-2-yl)methylidene]-1,3-bis(oxidanylidene)indene-5-carboxylic acid MLS000714193 cid_773112
Type:
Small organic molecule
Emp. Form.:
C16H10O5
Mol. Mass.:
282.2476
SMILES:
Cc1ccc(\C=C2\C(=O)c3ccc(cc3C2=O)C(O)=O)o1
: