Target
1-phosphatidylinositol 4,5-bisphosphate phosphodiesterase beta-3
Ligand
BDBM114253
Substrate
Meas. Tech.
Fluorescence-based biochemical high throughput dose response assay to identify inhibitors of phospholipase C isozymes (PLC-B3)
IC50
122480±n/a nM
Citation
 PubChem, PC Fluorescence-based biochemical high throughput dose response assay to identify inhibitors of phospholipase C isozymes (PLC-B3) PubChem Bioassay (2014)[AID] 
Target
Name:
1-phosphatidylinositol 4,5-bisphosphate phosphodiesterase beta-3
Synonyms:
PLCB3 Phospholipase C, beta 3 (phosphatidylinositol-specific) | Phospholipase C-beta-3
Type:
PROTEIN
Mol. Mass.:
138786.29
Organism:
Homo sapiens (Human)
Description:
EBI_12586
Residue:
1234
  
Inhibitor
Name:
BDBM114253
Synonyms:
4-{(E)-[2-(3-hydroxybenzoyl)hydrazono]methyl}phenyl benzoate SMR000313438 [4-[(E)-[(3-hydroxyphenyl)carbonylhydrazinylidene]methyl]phenyl] benzoate benzoic acid [4-[(E)-[[(3-hydroxyphenyl)-oxomethyl]hydrazinylidene]methyl]phenyl] ester | cid_9552815
Type:
Small organic molecule
Emp. Form.:
C21H16N2O4
Mol. Mass.:
360.3627
SMILES:
Oc1cccc(c1)C(=O)N\N=C\c1ccc(OC(=O)c2ccccc2)cc1
: