Target
1-phosphatidylinositol 4,5-bisphosphate phosphodiesterase beta-3
Ligand
BDBM52992
Substrate
Meas. Tech.
Fluorescence-based biochemical high throughput dose response assay to identify inhibitors of phospholipase C isozymes (PLC-B3)
IC50
122496±n/a nM
Citation
 PubChem, PC Fluorescence-based biochemical high throughput dose response assay to identify inhibitors of phospholipase C isozymes (PLC-B3) PubChem Bioassay (2014)[AID] 
Target
Name:
1-phosphatidylinositol 4,5-bisphosphate phosphodiesterase beta-3
Synonyms:
PLCB3 Phospholipase C, beta 3 (phosphatidylinositol-specific) | Phospholipase C-beta-3
Type:
PROTEIN
Mol. Mass.:
138786.29
Organism:
Homo sapiens (Human)
Description:
EBI_12586
Residue:
1234
  
Inhibitor
Name:
BDBM52992
Synonyms:
4,5,7,8-tetrahydroxy-1,2-naphthoquinone 4,5,7,8-tetrakis(oxidanyl)naphthalene-1,2-dione Mopain cid_75583
Type:
Small organic molecule
Emp. Form.:
C10H6O6
Mol. Mass.:
222.151
SMILES:
Oc1cc(O)c2C(=O)CC(=O)C(=O)c2c1O
: