Target
1-phosphatidylinositol 4,5-bisphosphate phosphodiesterase beta-3
Ligand
BDBM114273
Substrate
Meas. Tech.
Fluorescence-based biochemical high throughput dose response assay to identify inhibitors of phospholipase C isozymes (PLC-B3)
IC50
122392±n/a nM
Citation
 PubChem, PC Fluorescence-based biochemical high throughput dose response assay to identify inhibitors of phospholipase C isozymes (PLC-B3) PubChem Bioassay (2014)[AID] 
Target
Name:
1-phosphatidylinositol 4,5-bisphosphate phosphodiesterase beta-3
Synonyms:
PLCB3 Phospholipase C, beta 3 (phosphatidylinositol-specific) | Phospholipase C-beta-3
Type:
PROTEIN
Mol. Mass.:
138786.29
Organism:
Homo sapiens (Human)
Description:
EBI_12586
Residue:
1234
  
Inhibitor
Name:
BDBM114273
Synonyms:
2-[[3-(4-methylphenyl)-1-adamantyl]carbonylamino]ethanoic acid 2-[[3-(p-tolyl)adamantane-1-carbonyl]amino]acetic acid MLS001196778 SMR000555951 | cid_2770851
Type:
Small organic molecule
Emp. Form.:
C20H25NO3
Mol. Mass.:
327.4174
SMILES:
[H]C12CC3([H])CC(C1)(CC(C2)(C3)c1ccc(C)cc1)C(=O)NCC(O)=O
: