Target
1-phosphatidylinositol 4,5-bisphosphate phosphodiesterase beta-3
Ligand
BDBM114275
Substrate
Meas. Tech.
Fluorescence-based biochemical high throughput dose response assay to identify inhibitors of phospholipase C isozymes (PLC-B3)
IC50
122483±n/a nM
Citation
 PubChem, PC Fluorescence-based biochemical high throughput dose response assay to identify inhibitors of phospholipase C isozymes (PLC-B3) PubChem Bioassay (2014)[AID] 
Target
Name:
1-phosphatidylinositol 4,5-bisphosphate phosphodiesterase beta-3
Synonyms:
PLCB3 Phospholipase C, beta 3 (phosphatidylinositol-specific) | Phospholipase C-beta-3
Type:
PROTEIN
Mol. Mass.:
138786.29
Organism:
Homo sapiens (Human)
Description:
EBI_12586
Residue:
1234
  
Inhibitor
Name:
BDBM114275
Synonyms:
3-(2,4-dichlorobenzyl)-5-methoxy-1-methyl-pyrido[2,3-d]pyrimidine-2,4-quinone 3-[(2,4-dichlorophenyl)methyl]-5-methoxy-1-methylpyrido[2,3-d]pyrimidine-2,4-dione SMR000641470 | cid_18567280
Type:
Small organic molecule
Emp. Form.:
C16H13Cl2N3O3
Mol. Mass.:
366.199
SMILES:
COc1ccnc2n(C)c(=O)n(Cc3ccc(Cl)cc3Cl)c(=O)c12
: