Target
1-phosphatidylinositol 4,5-bisphosphate phosphodiesterase beta-3
Ligand
BDBM60948
Substrate
Meas. Tech.
Fluorescence-based biochemical high throughput dose response assay to identify inhibitors of phospholipase C isozymes (PLC-B3)
IC50
122481±n/a nM
Citation
 PubChem, PC Fluorescence-based biochemical high throughput dose response assay to identify inhibitors of phospholipase C isozymes (PLC-B3) PubChem Bioassay (2014)[AID] 
Target
Name:
1-phosphatidylinositol 4,5-bisphosphate phosphodiesterase beta-3
Synonyms:
PLCB3 Phospholipase C, beta 3 (phosphatidylinositol-specific) | Phospholipase C-beta-3
Type:
PROTEIN
Mol. Mass.:
138786.29
Organism:
Homo sapiens (Human)
Description:
EBI_12586
Residue:
1234
  
Inhibitor
Name:
BDBM60948
Synonyms:
5-[2-[(5Z)-5-(furan-2-ylmethylidene)-4-oxidanylidene-2-sulfanylidene-1,3-thiazolidin-3-yl]ethanoylamino]-2-oxidanyl-benzoic acid 5-[[2-[(5Z)-5-(2-furfurylidene)-4-keto-2-thioxo-thiazolidin-3-yl]acetyl]amino]-2-hydroxy-benzoic acid MLS001157823 cid_6237665
Type:
Small organic molecule
Emp. Form.:
C17H12N2O6S2
Mol. Mass.:
404.417
SMILES:
OC(=O)c1cc(NC(=O)CN2C(=S)S\C(=C/c3ccco3)C2=O)ccc1O
: