Target
1-phosphatidylinositol 4,5-bisphosphate phosphodiesterase beta-3
Ligand
BDBM114281
Substrate
Meas. Tech.
Fluorescence-based biochemical high throughput dose response assay to identify inhibitors of phospholipase C isozymes (PLC-B3)
IC50
122493±n/a nM
Citation
 PubChem, PC Fluorescence-based biochemical high throughput dose response assay to identify inhibitors of phospholipase C isozymes (PLC-B3) PubChem Bioassay (2014)[AID] 
Target
Name:
1-phosphatidylinositol 4,5-bisphosphate phosphodiesterase beta-3
Synonyms:
PLCB3 Phospholipase C, beta 3 (phosphatidylinositol-specific) | Phospholipase C-beta-3
Type:
PROTEIN
Mol. Mass.:
138786.29
Organism:
Homo sapiens (Human)
Description:
EBI_12586
Residue:
1234
  
Inhibitor
Name:
BDBM114281
Synonyms:
MLS001158792 N-(3-chlorophenyl)-2-(3-ethyl-5-methyl-7-oxo-2-sulfanylidene-6-thiazolo[4,5-d]pyrimidinyl)acetamide N-(3-chlorophenyl)-2-(3-ethyl-7-keto-5-methyl-2-thioxo-thiazolo[4,5-d]pyrimidin-6-yl)acetamide cid_8031245
Type:
Small organic molecule
Emp. Form.:
C16H15ClN4O2S2
Mol. Mass.:
394.899
SMILES:
CCn1c2nc(C)n(CC(=O)Nc3cccc(Cl)c3)c(=O)c2sc1=S
: