Target
1-phosphatidylinositol 4,5-bisphosphate phosphodiesterase beta-3
Ligand
BDBM114284
Substrate
Meas. Tech.
Fluorescence-based biochemical high throughput dose response assay to identify inhibitors of phospholipase C isozymes (PLC-B3)
IC50
122490±n/a nM
Citation
 PubChem, PC Fluorescence-based biochemical high throughput dose response assay to identify inhibitors of phospholipase C isozymes (PLC-B3) PubChem Bioassay (2014)[AID] 
Target
Name:
1-phosphatidylinositol 4,5-bisphosphate phosphodiesterase beta-3
Synonyms:
PLCB3 Phospholipase C, beta 3 (phosphatidylinositol-specific) | Phospholipase C-beta-3
Type:
PROTEIN
Mol. Mass.:
138786.29
Organism:
Homo sapiens (Human)
Description:
EBI_12586
Residue:
1234
  
Inhibitor
Name:
BDBM114284
Synonyms:
2-(2,5-diketospiro[imidazolidine-4,1'-tetralin]-1-yl)-N-homoveratryl-N-methyl-acetamide MLS001078544 N-[2-(3,4-dimethoxyphenyl)ethyl]-2-(2',5'-dioxospiro[2,3-dihydro-1H-naphthalene-4,4'-imidazolidine]-1'-yl)-N-methylacetamide cid_16362984
Type:
Small organic molecule
Emp. Form.:
C25H29N3O5
Mol. Mass.:
451.5149
SMILES:
COc1ccc(CCN(C)C(=O)CN2C(=O)NC3(CCCc4ccccc34)C2=O)cc1OC
: